Target
Interleukin-2
Ligand
BDBM50575331
Substrate
Meas. Tech.
ChEMBL_2124827 (CHEMBL4834060)
IC50
11±n/a nM
Citation
 Khedkar, NRIrlapatti, NRDadke, DKanoje, VShaikh, ZKarche, VShinde, VDeshmukh, GPatil, AJachak, SPhukan, SKizhakinagath, PAGholve, MBhankhede, TDaler, JNemade, HNBudhe, SPareek, HYeshodharan, RGupta, RKalia, APandey, DWagh, AKumar, SPatil, VModi, DSharma, NAhirrao, PMehta, MKumar, HNigade, PTamane, KMallurwar, SKuldharan, SPawar, SVishwase, GBokan, SSingh, MNaik, KIngawale, SShankar, RKamalakannan, PVenugopal, SGeorge, SKPadiya, KJNemmani, KVSGundu, JBhonde, MNarasimham, LSindkhedkar, MShah, CSinha, NSharma, SBakhle, DKamboj, RKPalle, VP Discovery of a Novel Potent and Selective Calcium Release-Activated Calcium Channel Inhibitor: 2,6-Difluoro- J Med Chem 64:17004-17030 (2021)  
Target
Name:
Interleukin-2
Synonyms:
IL-2 IL2_HUMAN Interleukin-2 T-cell growth factor | TCGF
Type:
Enzyme
Mol. Mass.:
17630.05
Organism:
Homo sapiens (Human)
Description:
P60568
Residue:
153
  
Inhibitor
Name:
BDBM50575331
Synonyms:
CHEMBL4868242
Type:
Small organic molecule
Emp. Form.:
C23H17F2N3O3
Mol. Mass.:
421.3962
SMILES:
Cc1c(cccc1-c1ccc(NC(=O)c2c(F)cccc2F)cc1)-c1nn(C)c(=O)o1
: