Target
Retinoic acid receptor RXR-alpha
Ligand
BDBM50141596
Substrate
Meas. Tech.
ChEMBL_196920 (CHEMBL807382)
Ki
12±n/a nM
Citation
 Michellys, PYD'Arrigo, JGrese, TAKaranewsky, DSLeibowitz, MDMais, DAMapes, CMReifel-Miller, ARungta, DBoehm, MF Design, synthesis and structure-activity relationship of novel RXR-selective modulators. Bioorg Med Chem Lett 14:1593-8 (2004)  
Target
Name:
Retinoic acid receptor RXR-alpha
Synonyms:
NR2B1 Nuclear receptor subfamily 4 group A member 2 RXRA Retinoic acid receptor RXR-alpha/gamma Retinoid receptor
Type:
PROTEIN
Mol. Mass.:
50820.38
Organism:
Homo sapiens (Human)
Description:
ChEMBL_1456363
Residue:
462
  
Inhibitor
Name:
BDBM50141596
Synonyms:
(E)-3-{4-[3,5-Di-tert-butyl-2-(2,2-difluoro-ethoxy)-phenyl]-benzo[b]thiophen-2-yl}-but-2-enoic acid | CHEMBL290761
Type:
Small organic molecule
Emp. Form.:
C28H32F2O3S
Mol. Mass.:
486.614
SMILES:
C\C(=C/C(O)=O)c1cc2c(cccc2s1)-c1cc(cc(c1OCC(F)F)C(C)(C)C)C(C)(C)C
: