Target
Retinoic acid receptor RXR-gamma
Ligand
BDBM50141597
Substrate
Meas. Tech.
ChEBML_196463
Ki
37±n/a nM
Citation
 Michellys, PYD'Arrigo, JGrese, TAKaranewsky, DSLeibowitz, MDMais, DAMapes, CMReifel-Miller, ARungta, DBoehm, MF Design, synthesis and structure-activity relationship of novel RXR-selective modulators. Bioorg Med Chem Lett 14:1593-8 (2004)  
Target
Name:
Retinoic acid receptor RXR-gamma
Synonyms:
NR2B3 RXRG Retinoic acid receptor RXR-gamma Retinoid X receptor gamma/retinoic acid receptor alpha
Type:
PROTEIN
Mol. Mass.:
50878.26
Organism:
Homo sapiens (Human)
Description:
ChEMBL_197216
Residue:
463
  
Inhibitor
Name:
BDBM50141597
Synonyms:
(E)-3-{4-[3,5-Di-tert-butyl-2-(3,3-difluoro-propoxy)-phenyl]-benzo[b]thiophen-2-yl}-but-2-enoic acid | CHEMBL43238
Type:
Small organic molecule
Emp. Form.:
C29H34F2O3S
Mol. Mass.:
500.64
SMILES:
C\C(=C/C(O)=O)c1cc2c(cccc2s1)-c1cc(cc(c1OCCC(F)F)C(C)(C)C)C(C)(C)C
: