Target
Retinoic acid receptor RXR-beta
Ligand
BDBM50141594
Substrate
Meas. Tech.
ChEBML_197088
Ki
142±n/a nM
Citation
 Michellys, PYD'Arrigo, JGrese, TAKaranewsky, DSLeibowitz, MDMais, DAMapes, CMReifel-Miller, ARungta, DBoehm, MF Design, synthesis and structure-activity relationship of novel RXR-selective modulators. Bioorg Med Chem Lett 14:1593-8 (2004)  
Target
Name:
Retinoic acid receptor RXR-beta
Synonyms:
NR2B2 RXRB Retinoic acid receptor RXR-beta Retinoid receptor
Type:
PROTEIN
Mol. Mass.:
56932.89
Organism:
Homo sapiens (Human)
Description:
ChEMBL_39045
Residue:
533
  
Inhibitor
Name:
BDBM50141594
Synonyms:
(E)-3-{7-[3,5-Diisopropyl-2-(2,2,2-trifluoro-ethoxy)-phenyl]-benzofuran-2-yl}-but-2-enoic acid | CHEMBL39206
Type:
Small organic molecule
Emp. Form.:
C26H27F3O4
Mol. Mass.:
460.4854
SMILES:
CC(C)c1cc(C(C)C)c(OCC(F)(F)F)c(c1)-c1cccc2cc(oc12)C(\C)=C\C(O)=O
: