Target
Retinoic acid receptor RXR-gamma
Ligand
BDBM50141602
Substrate
Meas. Tech.
ChEBML_196589
Ki
>10000±n/a nM
Citation
 Michellys, PYD'Arrigo, JGrese, TAKaranewsky, DSLeibowitz, MDMais, DAMapes, CMReifel-Miller, ARungta, DBoehm, MF Design, synthesis and structure-activity relationship of novel RXR-selective modulators. Bioorg Med Chem Lett 14:1593-8 (2004)  
Target
Name:
Retinoic acid receptor RXR-gamma
Synonyms:
Nr2b3 Retinoid X receptor gamma | Rxrg
Type:
PROTEIN
Mol. Mass.:
50900.28
Organism:
Mus musculus
Description:
ChEMBL_196589
Residue:
463
  
Inhibitor
Name:
BDBM50141602
Synonyms:
(E)-3-{7-[2-(3-Fluoro-propoxy)-3,5-diisopropyl-phenyl]-benzofuran-2-yl}-but-2-enoic acid | CHEMBL290399
Type:
Small organic molecule
Emp. Form.:
C27H31FO4
Mol. Mass.:
438.531
SMILES:
CC(C)c1cc(C(C)C)c(OCCCF)c(c1)-c1cccc2cc(oc12)C(\C)=C\C(O)=O
: