Target
Nuclear receptor subfamily 1 group I member 2
Ligand
BDBM429611
Substrate
Meas. Tech.
ChEMBL_2125194 (CHEMBL4834539)
IC50
2200±n/a nM
Citation
 Li, YLin, WWright, WCChai, SCWu, JChen, T Building a Chemical Toolbox for Human Pregnane X Receptor Research: Discovery of Agonists, Inverse Agonists, and Antagonists Among Analogs Based on the Unique Chemical Scaffold of SPA70. J Med Chem 64:1733-1761 (2021)  
Target
Name:
Nuclear receptor subfamily 1 group I member 2
Synonyms:
NR1I2 Orphan nuclear receptor PAR1 PXR SXR nuclear receptor subfamily 1 group I member 2 isoform 1
Type:
Nuclear receptor
Mol. Mass.:
49774.77
Organism:
Homo sapiens (Human)
Description:
O75469
Residue:
434
  
Inhibitor
Name:
BDBM429611
Synonyms:
US10550091, No. LC-20 | US10947203, No. LC-20
Type:
Small organic molecule
Emp. Form.:
C21H24BrN3O3S
Mol. Mass.:
478.403
SMILES:
COc1cc(Br)c(C)cc1-n1nnc(c1C)S(=O)(=O)c1ccc(cc1)C(C)(C)C
: