Target
SUMO-activating enzyme subunit 1/2
Ligand
BDBM50575602
Substrate
Meas. Tech.
ChEMBL_2125643 (CHEMBL4834988)
IC50
3.0±n/a nM
Citation
 Langston, SPGrossman, SEngland, DAfroze, RBence, NBowman, DBump, NChau, RChuang, BCClaiborne, CCohen, LConnolly, KDuffey, MDurvasula, NFreeze, SGallery, MGalvin, KGaulin, JGershman, RGreenspan, PGrieves, JGuo, JGulavita, NHailu, SHe, XHoar, KHu, YHu, ZIto, MKim, MSLane, SWLok, DLublinsky, AMallender, WMcIntyre, CMinissale, JMizutani, HMizutani, MMolchinova, NOno, KPatil, AQian, MRiceberg, JShindi, VSintchak, MDSong, KSoucy, TWang, YXu, HYang, XZawadzka, AZhang, JPulukuri, SM Discovery of TAK-981, a First-in-Class Inhibitor of SUMO-Activating Enzyme for the Treatment of Cancer. J Med Chem 64:2501-2520 (2021)  
Target
Name:
SUMO-activating enzyme subunit 1/2
Synonyms:
SUMO E1 | SUMO-activating enzyme
Type:
Mol. Mass.:
Description:
ASSAY_ID of ChEMBL is 977623
Components:
This complex has 2 components.
Component 1
Name:
SUMO-activating enzyme subunit 2
Synonyms:
6.3.2.- SAE2 SUMO-activating enzyme subunit 2 UBA2 Ubiquitin-like 1-activating enzyme E1B | Ubiquitin-like modifier-activating enzyme 2
Type:
Enzyme
Mol. Mass.:
71206.17
Organism:
Homo sapiens (Human)
Description:
Q9UBT2
Residue:
640
  
Component 2
Name:
SUMO-activating enzyme subunit 1
Synonyms:
AOS1 SAE1_HUMAN SUMO-activating enzyme subunit 1 (SAE1) UBLE1A
Type:
Enzyme Catalytic Domain
Mol. Mass.:
38440.84
Organism:
Homo sapiens (Human)
Description:
gi_17390638
Residue:
346
  
Inhibitor
Name:
BDBM50575602
Synonyms:
CHEMBL4867650
Type:
Small organic molecule
Emp. Form.:
C23H22Cl2N4O6S2
Mol. Mass.:
585.48
SMILES:
NS(=O)(=O)OC[C@H]1C[C@H](C[C@@H]1O)Nc1ncncc1C(=O)c1cc(C2OCc3ccc(Cl)cc23)c(Cl)s1
: