Target
Coagulation factor X
Ligand
BDBM50142111
Substrate
Meas. Tech.
ChEBML_49138
IC50
0.400000±n/a nM
Citation
 Zhang, PBao, LZuckett, JFGoldman, EAJia, ZJArfsten, AEdwards, SSinha, UHutchaleelaha, APark, GLambing, JLHollenbach, SJScarborough, RMZhu, BY Design, synthesis, and SAR of anthranilamide-based factor Xa inhibitors incorporating substituted biphenyl P4 motifs. Bioorg Med Chem Lett 14:983-7 (2004)  
Target
Name:
Coagulation factor X
Synonyms:
Activated coagulation factor X (FXa) Coagulation factor X precursor F10 Factor X heavy chain Factor Xa Stuart-Prower factor
Type:
Enzyme
Mol. Mass.:
54726.60
Organism:
Homo sapiens (Human)
Description:
Residue:
488
  
Inhibitor
Name:
BDBM50142111
Synonyms:
1-{4'-[4-Chloro-2-(5-chloro-pyridin-2-ylcarbamoyl)-phenylcarbamoyl]-biphenyl-2-yl}-piperidine-4-carboxylic acid | CHEMBL174330
Type:
Small organic molecule
Emp. Form.:
C31H26Cl2N4O4
Mol. Mass.:
589.469
SMILES:
OC(=O)C1CCN(CC1)c1ccccc1-c1ccc(cc1)C(=O)Nc1ccc(Cl)cc1C(=O)Nc1ccc(Cl)cn1
: