Target
Coagulation factor X
Ligand
BDBM50142161
Substrate
Meas. Tech.
ChEBML_48817
IC50
0.300000±n/a nM
Citation
 Zhang, PBao, LZuckett, JFJia, ZJWoolfrey, JArfsten, AEdwards, SSinha, UHutchaleelaha, ALambing, JLHollenbach, SJScarborough, RMZhu, BY Design, synthesis, and SAR of anthranilamide-based factor Xa inhibitors with improved functional activity. Bioorg Med Chem Lett 14:989-93 (2004)  
Target
Name:
Coagulation factor X
Synonyms:
Activated coagulation factor X (FXa) Coagulation factor X precursor F10 Factor X heavy chain Factor Xa Stuart-Prower factor
Type:
Enzyme
Mol. Mass.:
54726.60
Organism:
Homo sapiens (Human)
Description:
Residue:
488
  
Inhibitor
Name:
BDBM50142161
Synonyms:
5-Chloro-N-(5-chloro-pyridin-2-yl)-2-(4-{[methyl-(1-methyl-4,5-dihydro-1H-imidazol-2-yl)-amino]-methyl}-benzoylamino)-benzamide | CHEMBL175130
Type:
Small organic molecule
Emp. Form.:
C25H24Cl2N6O2
Mol. Mass.:
511.403
SMILES:
CN(Cc1ccc(cc1)C(=O)Nc1ccc(Cl)cc1C(=O)Nc1ccc(Cl)cn1)C1=NCCN1C
: