Target
Immunoglobulin lambda variable 6-57
Ligand
BDBM50576194
Substrate
Meas. Tech.
ChEMBL_2126711 (CHEMBL4836056)
EC50
228±n/a nM
Citation
 Yan, NLSantos-Martins, DNair, RChu, AWilson, IAJohnson, KAForli, SMorgan, GJPetrassi, HMKelly, JW Discovery of Potent Coumarin-Based Kinetic Stabilizers of Amyloidogenic Immunoglobulin Light Chains Using Structure-Based Design. J Med Chem 64:6273-6299 (2021)  
Target
Name:
Immunoglobulin lambda variable 6-57
Synonyms:
IGLV6-57 Ig lambda chain V-VI region EB4 Ig lambda chain V-VI region SUT Immunoglobulin lambda variable 6-57 | LV657_HUMAN
Type:
PROTEIN
Mol. Mass.:
12561.55
Organism:
Homo sapiens
Description:
ChEMBL_120180
Residue:
117
  
Inhibitor
Name:
BDBM50576194
Synonyms:
CHEMBL4858385
Type:
Small organic molecule
Emp. Form.:
C25H29N3O5
Mol. Mass.:
451.5149
SMILES:
CCN(CC)c1ccc2c(C)c(CCOC(=O)NCc3cccc(c3)C(N)=O)c(=O)oc2c1
: