Target
Immunoglobulin lambda variable 6-57
Ligand
BDBM50576206
Substrate
Meas. Tech.
ChEMBL_2126712 (CHEMBL4836057)
EC50
110±n/a nM
Citation
 Yan, NLSantos-Martins, DNair, RChu, AWilson, IAJohnson, KAForli, SMorgan, GJPetrassi, HMKelly, JW Discovery of Potent Coumarin-Based Kinetic Stabilizers of Amyloidogenic Immunoglobulin Light Chains Using Structure-Based Design. J Med Chem 64:6273-6299 (2021)  
Target
Name:
Immunoglobulin lambda variable 6-57
Synonyms:
IGLV6-57 Ig lambda chain V-VI region EB4 Ig lambda chain V-VI region SUT Immunoglobulin lambda variable 6-57 | LV657_HUMAN
Type:
PROTEIN
Mol. Mass.:
12561.55
Organism:
Homo sapiens
Description:
ChEMBL_120180
Residue:
117
  
Inhibitor
Name:
BDBM50576206
Synonyms:
CHEMBL4856361
Type:
Small organic molecule
Emp. Form.:
C28H32N8O4
Mol. Mass.:
544.6049
SMILES:
CCN(CC)c1ccc2c(C)c(CCN3C(=O)NC4(CCN(CC4)c4ncnc5[nH]cnc45)C3=O)c(=O)oc2c1
: