Target
Alpha-1A adrenergic receptor
Ligand
BDBM50143673
Substrate
Meas. Tech.
ChEMBL_34031 (CHEMBL646170)
Ki
42.41±n/a nM
Citation
 Leonardi, ABarlocco, DMontesano, FCignarella, GMotta, GTesta, RPoggesi, ESeeber, MDe Benedetti, PGFanelli, F Synthesis, screening, and molecular modeling of new potent and selective antagonists at the alpha 1d adrenergic receptor. J Med Chem 47:1900-18 (2004)  
Target
Name:
Alpha-1A adrenergic receptor
Synonyms:
ADA1A_RAT Adra1c Alpha-1A adrenoceptor Alpha-1C adrenergic receptor | adrenergic Alpha1A
Type:
Protein
Mol. Mass.:
51620.15
Organism:
Rattus norvegicus (Rat)
Description:
P43140
Residue:
466
  
Inhibitor
Name:
BDBM50143673
Synonyms:
8-{2-[4-(2,5-Dichloro-phenyl)-piperazin-1-yl]-ethyl}-8-aza-spiro[4.5]decan-7-one | CHEMBL301224
Type:
Small organic molecule
Emp. Form.:
C21H29Cl2N3O
Mol. Mass.:
410.38
SMILES:
Clc1ccc(Cl)c(c1)N1CCN(CCN2CCC3(CCCC3)CC2=O)CC1
: