Target
Alpha-1D adrenergic receptor
Ligand
BDBM50143680
Substrate
Meas. Tech.
ChEMBL_32721 (CHEMBL645993)
Ki
0.54±n/a nM
Citation
 Leonardi, ABarlocco, DMontesano, FCignarella, GMotta, GTesta, RPoggesi, ESeeber, MDe Benedetti, PGFanelli, F Synthesis, screening, and molecular modeling of new potent and selective antagonists at the alpha 1d adrenergic receptor. J Med Chem 47:1900-18 (2004)  
Target
Name:
Alpha-1D adrenergic receptor
Synonyms:
ADA1D_RAT Adra1d Alpha-1D adrenergic receptor | Serotonin 1a (5-HT1a) receptor/Adrenergic receptor alpha-1
Type:
Protein
Mol. Mass.:
59375.97
Organism:
Rattus norvegicus (Rat)
Description:
P23944
Residue:
561
  
Inhibitor
Name:
BDBM50143680
Synonyms:
8-{2-[4-(2-Chloro-phenyl)-piperazin-1-yl]-ethyl}-8-aza-spiro[4.5]decan-7-one | CHEMBL299454
Type:
Small organic molecule
Emp. Form.:
C21H30ClN3O
Mol. Mass.:
375.935
SMILES:
Clc1ccccc1N1CCN(CCN2CCC3(CCCC3)CC2=O)CC1
: