Target
Dihydrofolate reductase
Ligand
BDBM18224
Substrate
Meas. Tech.
ChEMBL_54624 (CHEMBL668846)
IC50
0.61±n/a nM
Citation
 Rosowsky, AFu, HChan, DCQueener, SF Synthesis of 2,4-diamino-6-[2'-O-(omega-carboxyalkyl)oxydibenz[b,f]azepin-5-yl]methylpteridines as potent and selective inhibitors of Pneumocystis carinii, Toxoplasma gondii, and Mycobacterium avium dihydrofolate reductase. J Med Chem 47:2475-85 (2004)  
Target
Name:
Dihydrofolate reductase
Synonyms:
DHFR Dihydrofolate reductase (DHFR) | Tetrahydrofolate dehydrogenase
Type:
Enzyme
Mol. Mass.:
21453.99
Organism:
Homo sapiens (Human)
Description:
Recombinant human DHFR.
Residue:
187
  
Inhibitor
Name:
BDBM18224
Synonyms:
6-[(2,5-dimethoxyphenyl)methyl]-5-methylpyrido[2,3-d]pyrimidine-2,4-diamine PTX [2-amino-6-(2,5-dimethoxybenzyl)-5-methyl-pyrido[2,3-d]pyrimidin-4-yl]amine;2-hydroxyethanesulfonic acid
Type:
Small organic molecule
Emp. Form.:
C17H19N5O2
Mol. Mass.:
325.3651
SMILES:
COc1ccc(OC)c(Cc2cnc3nc(N)nc(N)c3c2C)c1
: