Target
Beta-1 adrenergic receptor
Ligand
BDBM50578618
Substrate
Meas. Tech.
ChEMBL_2133587 (CHEMBL4843197)
EC50
2.4±n/a nM
Citation
 Xing, GZhi, ZYi, CZou, JJing, XYiu-Ho Woo, ALin, BPan, LZhang, YCheng, M 8-Hydroxyquinolin-2(1H)-one analogues as potential ? Eur J Med Chem 224:0 (2021)  
Target
Name:
Beta-1 adrenergic receptor
Synonyms:
ADRB1 ADRB1_HUMAN Beta-1 adrenoceptor adrenergic Beta1
Type:
G Protein-Coupled Receptor (GPCR)
Mol. Mass.:
51338.40
Organism:
Homo sapiens (Human)
Description:
P08588
Residue:
477
  
Inhibitor
Name:
BDBM50578618
Synonyms:
CHEMBL4854261
Type:
Small organic molecule
Emp. Form.:
C22H27ClN2O4
Mol. Mass.:
418.914
SMILES:
Cl.CC(C)(CCc1cccc(O)c1)NCC(O)c1ccc(O)c2[nH]c(=O)ccc12
: