Target
Protein mono-ADP-ribosyltransferase PARP4
Ligand
BDBM50579974
Substrate
Meas. Tech.
ChEMBL_2146114 (CHEMBL5030394)
IC50
>10000±n/a nM
Citation
 Leenders, RGGBrinch, SASowa, STAmundsen-Isaksen, EGalera-Prat, AMurthy, SAertssen, SSmits, JNNieczypor, PDamen, EWegert, ANazaré, MLehtiö, LWaaler, JKrauss, S Development of a 1,2,4-Triazole-Based Lead Tankyrase Inhibitor: Part II. J Med Chem 64:17936-17949 (2021)  
Target
Name:
Protein mono-ADP-ribosyltransferase PARP4
Synonyms:
(ARTD4 or PARP4) 2.4.2.- ADP-ribosyltransferase diphtheria toxin-like 4 ADPRTL1 KIAA0177 PARP-4 PARP4 PARPL Poly [ADP-ribose] polymerase 4 VPARP | Vault poly(ADP-ribose) polymerase
Type:
Mol. Mass.:
192563.23
Organism:
Homo sapiens (Human)
Description:
Q9UKK3
Residue:
1724
  
Inhibitor
Name:
BDBM50579974
Synonyms:
CHEMBL5090849 | US20230322721, Example 154 of WO 2019/243822
Type:
Small organic molecule
Emp. Form.:
C28H24FN7O2
Mol. Mass.:
509.5343
SMILES:
CCOc1ccc(nc1)-c1nnc([C@H]2C[C@@H](C2)NC(=O)c2cccc3nccnc23)n1-c1ccccc1F
: