Target
Adenosine receptor A2a
Ligand
BDBM50147634
Substrate
Meas. Tech.
ChEBML_31364
Ki
57±n/a nM
Citation
 Guba, WNettekoven, MPüllmann, BRiemer, CSchmitt, S Comparison of inhibitory activity of isomeric triazolopyridine derivatives towards adenosine receptor subtypes or do similar structures reveal similar bioactivities? Bioorg Med Chem Lett 14:3307-12 (2004)  
Target
Name:
Adenosine receptor A2a
Synonyms:
A2A adenosine receptor (hA2A) ADENOSINE A2 ADORA2 Adenosine A2A receptor (A2AAR)
Type:
G Protein-Coupled Receptor (GPCR)
Mol. Mass.:
44716.46
Organism:
Homo sapiens (Human)
Description:
P29274
Residue:
412
  
Inhibitor
Name:
BDBM50147634
Synonyms:
CHEMBL419191 | [8-Amino-2-(5-methyl-furan-2-yl)-[1,2,4]triazolo[1,5-a]pyridin-6-yl]-piperidin-1-yl-methanone
Type:
Small organic molecule
Emp. Form.:
C17H19N5O2
Mol. Mass.:
325.3651
SMILES:
Cc1ccc(o1)-c1nc2c(N)cc(cn2n1)C(=O)N1CCCCC1
: