Target
Histamine H3 receptor
Ligand
BDBM50580515
Substrate
Meas. Tech.
ChEMBL_2148505 (CHEMBL5032903)
Ki
11±n/a nM
Citation
 Hagenow, SAffini, APioli, EYHinz, SZhao, YPorras, GNamasivayam, VMüller, CELin, JSBezard, EStark, H Adenosine A J Med Chem 64:8246-8262 (2021)  
Target
Name:
Histamine H3 receptor
Synonyms:
G-protein coupled receptor 97 HH3R HRH3 Histamine H3 receptor (H3) Histamine receptor (H3 and H4)
Type:
G Protein-Coupled Receptor (GPCR)
Mol. Mass.:
48691.47
Organism:
Homo sapiens (Human)
Description:
Binding assays were using CHO cells stably expressing hH3R receptors.
Residue:
445
  
Inhibitor
Name:
BDBM50580515
Synonyms:
CHEMBL5088622
Type:
Small organic molecule
Emp. Form.:
C24H26N4O
Mol. Mass.:
386.4894
SMILES:
Nc1nc-2c(Cc3ccc(OCCCN4CCCC4)cc-23)c(n1)-c1ccccc1
: