Target
Cell division protein FtsZ
Ligand
BDBM50581027
Substrate
Meas. Tech.
ChEMBL_2149614 (CHEMBL5034076)
Kd
6700±n/a nM
Citation
 Huecas, SAraújo-Bazán, LRuiz, FMRuiz-Ávila, LBMartínez, RFEscobar-Peńa, AArtola, MVázquez-Villa, HMartín-Fontecha, MFernández-Tornero, CLópez-Rodríguez, MLAndreu, JM Targeting the FtsZ Allosteric Binding Site with a Novel Fluorescence Polarization Screen, Cytological and Structural Approaches for Antibacterial Discovery. J Med Chem 64:5730-5745 (2021)  
Target
Name:
Cell division protein FtsZ
Synonyms:
Type:
PROTEIN
Mol. Mass.:
40375.29
Organism:
Bacillus subtilis
Description:
ChEMBL_107642
Residue:
382
  
Inhibitor
Name:
BDBM50581027
Synonyms:
CHEMBL5081697
Type:
Small organic molecule
Emp. Form.:
C15H10F5NO2
Mol. Mass.:
331.2374
SMILES:
NC(=O)c1c(F)ccc(OCc2ccc(cc2)C(F)(F)F)c1F
: