Target
Cell division protein FtsZ
Ligand
BDBM50581029
Substrate
Meas. Tech.
ChEMBL_2149614 (CHEMBL5034076)
Kd
1500±n/a nM
Citation
 Huecas, SAraújo-Bazán, LRuiz, FMRuiz-Ávila, LBMartínez, RFEscobar-Peńa, AArtola, MVázquez-Villa, HMartín-Fontecha, MFernández-Tornero, CLópez-Rodríguez, MLAndreu, JM Targeting the FtsZ Allosteric Binding Site with a Novel Fluorescence Polarization Screen, Cytological and Structural Approaches for Antibacterial Discovery. J Med Chem 64:5730-5745 (2021)  
Target
Name:
Cell division protein FtsZ
Synonyms:
Type:
PROTEIN
Mol. Mass.:
40375.29
Organism:
Bacillus subtilis
Description:
ChEMBL_107642
Residue:
382
  
Inhibitor
Name:
BDBM50581029
Synonyms:
CHEMBL5085966
Type:
Small organic molecule
Emp. Form.:
C17H14F5NO2
Mol. Mass.:
359.2906
SMILES:
NC(=O)c1c(F)ccc(OCCCc2cccc(c2)C(F)(F)F)c1F
: