Target
Cell division protein FtsZ
Ligand
BDBM50581031
Substrate
Meas. Tech.
ChEMBL_2149614 (CHEMBL5034076)
Kd
1900±n/a nM
Citation
 Huecas, SAraújo-Bazán, LRuiz, FMRuiz-Ávila, LBMartínez, RFEscobar-Peńa, AArtola, MVázquez-Villa, HMartín-Fontecha, MFernández-Tornero, CLópez-Rodríguez, MLAndreu, JM Targeting the FtsZ Allosteric Binding Site with a Novel Fluorescence Polarization Screen, Cytological and Structural Approaches for Antibacterial Discovery. J Med Chem 64:5730-5745 (2021)  
Target
Name:
Cell division protein FtsZ
Synonyms:
Type:
PROTEIN
Mol. Mass.:
40375.29
Organism:
Bacillus subtilis
Description:
ChEMBL_107642
Residue:
382
  
Inhibitor
Name:
BDBM50581031
Synonyms:
CHEMBL5074266
Type:
Small organic molecule
Emp. Form.:
C18H17F2N5O5
Mol. Mass.:
421.3549
SMILES:
CCC[C@@H](COc1ccc(F)c(C(N)=O)c1F)Nc1ccc([N+]([O-])=O)c2nonc12
: