Target
Dual specificity tyrosine-phosphorylation-regulated kinase 1B
Ligand
BDBM50581233
Substrate
Meas. Tech.
ChEMBL_2150108 (CHEMBL5034570)
IC50
1.000000±n/a nM
Citation
 Lee Walmsley, DMurray, JBDokurno, PMassey, AJBenwell, KFiumana, AFoloppe, NRay, SSmith, JSurgenor, AEEdmonds, TDemarles, DBurbridge, MCruzalegui, FKotschy, AHubbard, RE Fragment-Derived Selective Inhibitors of Dual-Specificity Kinases DYRK1A and DYRK1B. J Med Chem 64:8971-8991 (2021)  
Target
Name:
Dual specificity tyrosine-phosphorylation-regulated kinase 1B
Synonyms:
DYR1B_HUMAN Dual specificity tyrosine-phosphorylation-regulated kinase 1B MIRK
Type:
Enzyme
Mol. Mass.:
69222.24
Organism:
Homo sapiens (Human)
Description:
Q9Y463
Residue:
629
  
Inhibitor
Name:
BDBM50581233
Synonyms:
CHEMBL5091510
Type:
Small organic molecule
Emp. Form.:
C17H15N5OS
Mol. Mass.:
337.399
SMILES:
Cc1nc(OCc2ccsc2)c2c(c[nH]c2n1)-c1ccnc(N)c1
: