Target
Plasminogen activator inhibitor 1
Ligand
BDBM50149275
Substrate
Meas. Tech.
ChEMBL_155742 (CHEMBL760892)
Kd
480±n/a nM
Citation
 Elokdah, HAbou-Gharbia, MHennan, JKMcFarlane, GMugford, CPKrishnamurthy, GCrandall, DL Tiplaxtinin, a novel, orally efficacious inhibitor of plasminogen activator inhibitor-1: design, synthesis, and preclinical characterization. J Med Chem 47:3491-4 (2004)  
Target
Name:
Plasminogen activator inhibitor 1
Synonyms:
Endothelial plasminogen activator inhibitor PAI-1 Pai1 Plasminogen activator inhibitor 1 Serpine1
Type:
PROTEIN
Mol. Mass.:
45009.76
Organism:
Rattus norvegicus
Description:
ChEMBL_155741
Residue:
402
  
Inhibitor
Name:
BDBM50149275
Synonyms:
2-(1-benzyl-5-(4-(trifluoromethoxy)phenyl)-1H-indol-3-yl)-2-oxoacetic acid [1-Benzyl-5-(4-trifluoromethoxy-phenyl)-1H-indol-3-yl]-oxo-acetic acid | [{1-benzyl-5-[4-(trifluoromethoxy)phenyl]-1H-indol-3-yl}(oxo)acetic acid
Type:
Small organic molecule
Emp. Form.:
C24H16F3NO4
Mol. Mass.:
439.3833
SMILES:
OC(=O)C(=O)c1cn(Cc2ccccc2)c2ccc(cc12)-c1ccc(OC(F)(F)F)cc1
: