Target
Adenosine receptor A1
Ligand
BDBM50581950
Substrate
Meas. Tech.
ChEMBL_2152684 (CHEMBL5037231)
Ki
0.400000±n/a nM
Citation
 Trinh, PNHChong, DJWLeach, KHill, SJTyndall, JDAMay, LTVernall, AJGregory, KJ Development of Covalent, Clickable Probes for Adenosine A J Med Chem 64:8161-8178 (2021)  
Target
Name:
Adenosine receptor A1
Synonyms:
A1 adenosine receptor (hA1) AA1R_HUMAN ADORA1 Adenosine A1-receptor Adenosine receptor A1 (hA1) | Adenosine transporter (AdT)
Type:
G Protein-Coupled Receptor (GPCR)
Mol. Mass.:
36520.92
Organism:
Homo sapiens (Human)
Description:
P30542
Residue:
326
  
Inhibitor
Name:
BDBM50581950
Synonyms:
CHEMBL4204703
Type:
Small organic molecule
Emp. Form.:
C18H20N4O
Mol. Mass.:
308.3776
SMILES:
O[C@H]1CC[C@@H](CC1)Nc1nc(nc2[nH]ccc12)-c1ccccc1
: