Target
Telomerase reverse transcriptase
Ligand
BDBM50134030
Substrate
Meas. Tech.
ChEMBL_304170 (CHEMBL830008)
EC50
113±n/a nM
Citation
 Schultes, CMGuyen, BCuesta, JNeidle, S Synthesis, biophysical and biological evaluation of 3,6-bis-amidoacridines with extended 9-anilino substituents as potent G-quadruplex-binding telomerase inhibitors. Bioorg Med Chem Lett 14:4347-51 (2004)  
Target
Name:
Telomerase reverse transcriptase
Synonyms:
EST2 TERT TRT
Type:
PROTEIN
Mol. Mass.:
127099.03
Organism:
Homo sapiens (Human)
Description:
ChEMBL_1447029
Residue:
1132
  
Inhibitor
Name:
BDBM50134030
Synonyms:
9-[4-(N,N-dimethylamino)phenylamino]-3,6-bis(3-pyrrolodinopropionamido) acridine N,N'-(9-{[4-(dimethylamino)phenyl]amino}acridine-3,6-diyl)bis(3-pyrrolidin-1-ylpropanamide)
Type:
Small organic molecule
Emp. Form.:
C35H43N7O2
Mol. Mass.:
593.7616
SMILES:
CN(C)c1ccc(Nc2c3ccc(NC(=O)CCN4CCCC4)cc3nc3cc(NC(=O)CCN4CCCC4)ccc23)cc1
: