Target
Nucleotide-binding oligomerization domain-containing protein 2
Ligand
BDBM50582634
Substrate
Meas. Tech.
ChEMBL_2155335 (CHEMBL5039995)
EC50
39±n/a nM
Citation
 Guzelj, SNabergoj, SGobec, MPajk, SKlan?i?, VSlütter, BFrkanec, R?timac, A?ket, PPlavec, JMlinari?-Ra??an, IJakopin, ? Structural Fine-Tuning of Desmuramylpeptide NOD2 Agonists Defines Their  J Med Chem 64:7809-7838 (2021)  
Target
Name:
Nucleotide-binding oligomerization domain-containing protein 2
Synonyms:
CARD15 IBD1 NOD2 Nucleotide-binding oligomerization domain-containing protein 2 | nucleotide-binding oligomerization domain containing 2
Type:
PROTEIN
Mol. Mass.:
115287.18
Organism:
Homo sapiens (Human)
Description:
ChEMBL_1454053
Residue:
1040
  
Inhibitor
Name:
BDBM50582634
Synonyms:
CHEMBL5077049
Type:
Small organic molecule
Emp. Form.:
C26H35F2N3O7
Mol. Mass.:
539.5688
SMILES:
CCOC(=O)CC[C@@H](NC(=O)[C@@H](NC(=O)CNC(=O)[C@@H]1C[C@H]1c1ccc(F)c(F)c1)C(C)C)C(=O)OCC
: