Target
Nucleotide-binding oligomerization domain-containing protein 2
Ligand
BDBM50582647
Substrate
Meas. Tech.
ChEMBL_2155335 (CHEMBL5039995)
EC50
1448±n/a nM
Citation
 Guzelj, SNabergoj, SGobec, MPajk, SKlan?i?, VSlütter, BFrkanec, R?timac, A?ket, PPlavec, JMlinari?-Ra??an, IJakopin, ? Structural Fine-Tuning of Desmuramylpeptide NOD2 Agonists Defines Their  J Med Chem 64:7809-7838 (2021)  
Target
Name:
Nucleotide-binding oligomerization domain-containing protein 2
Synonyms:
CARD15 IBD1 NOD2 Nucleotide-binding oligomerization domain-containing protein 2 | nucleotide-binding oligomerization domain containing 2
Type:
PROTEIN
Mol. Mass.:
115287.18
Organism:
Homo sapiens (Human)
Description:
ChEMBL_1454053
Residue:
1040
  
Inhibitor
Name:
BDBM50582647
Synonyms:
CHEMBL5087802
Type:
Small organic molecule
Emp. Form.:
C43H69N3O11
Mol. Mass.:
804.0215
SMILES:
CCCCCCCCCCCCCCCCCC(=O)Oc1ccc(\C=C\C(=O)NCC(=O)N[C@@H]([C@@H](C)O)C(=O)N[C@H](CCC(=O)OCC)C(=O)OCC)cc1OC
: