Target
Cathepsin S
Ligand
BDBM50152521
Substrate
Meas. Tech.
ChEMBL_306256 (CHEMBL828389)
IC50
34±n/a nM
Citation
 Barrett, DGCatalano, JGDeaton, DNHassell, AMLong, STMiller, ABMiller, LRShewchuk, LMWells-Knecht, KJWillard, DHWright, LL Potent and selective P2-P3 ketoamide inhibitors of cathepsin K with good pharmacokinetic properties via favorable P1', P1, and/or P3 substitutions. Bioorg Med Chem Lett 14:4897-902 (2004)  
Target
Name:
Cathepsin S
Synonyms:
CATS_HUMAN Cathepsin S (Cat S) | cathepsin S preproprotein
Type:
Protein
Mol. Mass.:
37507.38
Organism:
Homo sapiens (Human)
Description:
P25774
Residue:
331
  
Inhibitor
Name:
BDBM50152521
Synonyms:
(1-phenethylcyclobutyl)methyl(S)-1,2-dioxo-1-((R)-1-phenylethylamino)heptan-3-ylcarbamate [(S)-1-((R)-1-Phenyl-ethylaminooxalyl)-pentyl]-carbamic acid 1-phenethyl-cyclobutylmethyl ester
Type:
Small organic molecule
Emp. Form.:
C29H38N2O4
Mol. Mass.:
478.623
SMILES:
CCCC[C@H](NC(=O)OCC1(CCc2ccccc2)CCC1)C(=O)C(=O)N[C@H](C)c1ccccc1
: