Target
Cathepsin K
Ligand
BDBM50152521
Substrate
Meas. Tech.
ChEMBL_304743 (CHEMBL829342)
IC50
24±n/a nM
Citation
 Barrett, DGCatalano, JGDeaton, DNHassell, AMLong, STMiller, ABMiller, LRShewchuk, LMWells-Knecht, KJWillard, DHWright, LL Potent and selective P2-P3 ketoamide inhibitors of cathepsin K with good pharmacokinetic properties via favorable P1', P1, and/or P3 substitutions. Bioorg Med Chem Lett 14:4897-902 (2004)  
Target
Name:
Cathepsin K
Synonyms:
CATK_HUMAN CTSO Cathepsin O Cathepsin X
Type:
Enzyme
Mol. Mass.:
36975.68
Organism:
Homo sapiens (Human)
Description:
P43235
Residue:
329
  
Inhibitor
Name:
BDBM50152521
Synonyms:
(1-phenethylcyclobutyl)methyl(S)-1,2-dioxo-1-((R)-1-phenylethylamino)heptan-3-ylcarbamate [(S)-1-((R)-1-Phenyl-ethylaminooxalyl)-pentyl]-carbamic acid 1-phenethyl-cyclobutylmethyl ester
Type:
Small organic molecule
Emp. Form.:
C29H38N2O4
Mol. Mass.:
478.623
SMILES:
CCCC[C@H](NC(=O)OCC1(CCc2ccccc2)CCC1)C(=O)C(=O)N[C@H](C)c1ccccc1
: