Target
Flap endonuclease 1
Ligand
BDBM50152567
Substrate
Meas. Tech.
ChEMBL_304758 (CHEMBL829355)
IC50
1520±n/a nM
Citation
 Tumey, LNHuck, BGleason, EWang, JSilver, DBrunden, KBoozer, SRundlett, SSherf, BMurphy, SBailey, ADent, TLeventhal, CHarrington, JBennani, YL The identification and optimization of 2,4-diketobutyric acids as flap endonuclease 1 inhibitors. Bioorg Med Chem Lett 14:4915-8 (2004)  
Target
Name:
Flap endonuclease 1
Synonyms:
DNase IV FEN1 Flap structure-specific endonuclease 1 Maturation factor 1 hFEN-1
Type:
PROTEIN
Mol. Mass.:
42602.57
Organism:
Homo sapiens (Human)
Description:
ChEMBL_1517026
Residue:
380
  
Inhibitor
Name:
BDBM50152567
Synonyms:
2,4-Dioxo-4-(5-trifluoromethyl-thiophen-2-yl)-butyric acid | CHEMBL367585
Type:
Small organic molecule
Emp. Form.:
C9H5F3O4S
Mol. Mass.:
266.194
SMILES:
OC(=O)C(=O)CC(=O)c1ccc(s1)C(F)(F)F
: