Target
Disintegrin and metalloproteinase domain-containing protein 17
Ligand
BDBM50152910
Substrate
Meas. Tech.
ChEMBL_312057 (CHEMBL835217)
IC50
900±n/a nM
Citation
 Xue, CBChen, XTHe, XRoderick, JCorbett, RLGhavimi, BLiu, RQCovington, MBQian, MRibadeneira, MDVaddi, KTrzaskos, JNewton, RCDuan, JJDecicco, CP Synthesis and structure-activity relationship of a novel sulfone series of TNF-alpha converting enzyme inhibitors. Bioorg Med Chem Lett 14:4453-9 (2004)  
Target
Name:
Disintegrin and metalloproteinase domain-containing protein 17
Synonyms:
ADA17_HUMAN CSVP Disintegrin and metalloproteinase domain-containing protein 17 (ADAM17) TNF-alpha convertase TNF-alpha-converting enzyme (TACE) Tumor necrosis factor-α converting enzyme (TACE)
Type:
Enzyme
Mol. Mass.:
93007.89
Organism:
Homo sapiens (Human)
Description:
Residue:
824
  
Inhibitor
Name:
BDBM50152910
Synonyms:
1-Butyl-3-[4-(2-methyl-quinolin-4-ylmethoxy)-benzenesulfonylmethyl]-piperidine-4-carboxylic acid hydroxyamide | CHEMBL363451
Type:
Small organic molecule
Emp. Form.:
C28H35N3O5S
Mol. Mass.:
525.66
SMILES:
CCCCN1CCC(C(CS(=O)(=O)c2ccc(OCc3cc(C)nc4ccccc34)cc2)C1)C(=O)NO
: