Target
Collagenase 3
Ligand
BDBM50152910
Substrate
Meas. Tech.
ChEMBL_302721 (CHEMBL839592)
Ki
>5000±n/a nM
Citation
 Xue, CBChen, XTHe, XRoderick, JCorbett, RLGhavimi, BLiu, RQCovington, MBQian, MRibadeneira, MDVaddi, KTrzaskos, JNewton, RCDuan, JJDecicco, CP Synthesis and structure-activity relationship of a novel sulfone series of TNF-alpha converting enzyme inhibitors. Bioorg Med Chem Lett 14:4453-9 (2004)  
Target
Name:
Collagenase 3
Synonyms:
MMP-13 MMP13_HUMAN Matrix metalloproteinase-13 (MMP-13) | Matrix metalloproteinase-13 (MMP13)
Type:
Enzyme
Mol. Mass.:
53808.06
Organism:
Homo sapiens (Human)
Description:
P45452
Residue:
471
  
Inhibitor
Name:
BDBM50152910
Synonyms:
1-Butyl-3-[4-(2-methyl-quinolin-4-ylmethoxy)-benzenesulfonylmethyl]-piperidine-4-carboxylic acid hydroxyamide | CHEMBL363451
Type:
Small organic molecule
Emp. Form.:
C28H35N3O5S
Mol. Mass.:
525.66
SMILES:
CCCCN1CCC(C(CS(=O)(=O)c2ccc(OCc3cc(C)nc4ccccc34)cc2)C1)C(=O)NO
: