Target
72 kDa type IV collagenase
Ligand
BDBM50152910
Substrate
Meas. Tech.
ChEMBL_302675 (CHEMBL839438)
Ki
>3300±n/a nM
Citation
 Xue, CBChen, XTHe, XRoderick, JCorbett, RLGhavimi, BLiu, RQCovington, MBQian, MRibadeneira, MDVaddi, KTrzaskos, JNewton, RCDuan, JJDecicco, CP Synthesis and structure-activity relationship of a novel sulfone series of TNF-alpha converting enzyme inhibitors. Bioorg Med Chem Lett 14:4453-9 (2004)  
Target
Name:
72 kDa type IV collagenase
Synonyms:
72 kDa gelatinase CLG4A Gelatinase A (MMP-2) MMP2_HUMAN Matrix metalloproteinase-2 (MMP 2) Matrix metalloproteinases 2 (MMP-2) | TBE-1
Type:
Enzyme
Mol. Mass.:
73870.36
Organism:
Homo sapiens (Human)
Description:
P08253
Residue:
660
  
Inhibitor
Name:
BDBM50152910
Synonyms:
1-Butyl-3-[4-(2-methyl-quinolin-4-ylmethoxy)-benzenesulfonylmethyl]-piperidine-4-carboxylic acid hydroxyamide | CHEMBL363451
Type:
Small organic molecule
Emp. Form.:
C28H35N3O5S
Mol. Mass.:
525.66
SMILES:
CCCCN1CCC(C(CS(=O)(=O)c2ccc(OCc3cc(C)nc4ccccc34)cc2)C1)C(=O)NO
: