Target
Dual specificity tyrosine-phosphorylation-regulated kinase 2
Ligand
BDBM50583755
Substrate
Meas. Tech.
ChEMBL_2158058 (CHEMBL5042808)
IC50
6.0±n/a nM
Citation
 Weber, CSipos, MPaczal, ABalint, BKun, VFoloppe, NDokurno, PMassey, AJWalmsley, DLHubbard, REMurray, JBenwell, KEdmonds, TDemarles, DBruno, ABurbridge, MCruzalegui, FKotschy, A Structure-Guided Discovery of Potent and Selective DYRK1A Inhibitors. J Med Chem 64:6745-6764 (2021)  
Target
Name:
Dual specificity tyrosine-phosphorylation-regulated kinase 2
Synonyms:
DYRK2 Dual-specificity tyrosine-phosphorylation regulated kinase 2
Type:
PROTEIN
Mol. Mass.:
66690.69
Organism:
Homo sapiens (Human)
Description:
ChEMBL_1508025
Residue:
601
  
Inhibitor
Name:
BDBM50583755
Synonyms:
CHEMBL5070553
Type:
Small organic molecule
Emp. Form.:
C14H13F3N6
Mol. Mass.:
322.2884
SMILES:
Cc1nc2ccc(nc2n1CC(F)(F)F)-c1cc(N)nc(N)c1
: