Target
ATP-binding cassette sub-family C member 8
Ligand
BDBM50153521
Substrate
Meas. Tech.
ChEMBL_302175 (CHEMBL830078)
Kd
83±n/a nM
Citation
 Wängler, BBeck, CShiue, CYSchneider, SSchwanstecher, CSchwanstecher, MFeilen, PJAlavi, ARösch, FSchirrmacher, R Synthesis and in vitro evaluation of (S)-2-([11C]methoxy)-4-[3-methyl-1-(2-piperidine-1-yl-phenyl)-butyl-carbamoyl]-benzoic acid ([11C]methoxy-repaglinide): a potential beta-cell imaging agent. Bioorg Med Chem Lett 14:5205-9 (2004)  
Target
Name:
ATP-binding cassette sub-family C member 8
Synonyms:
ABCC8 ATP-binding cassette sub-family C member 8 HRINS SUR Sulfonylurea receptor 1 | Sulfonylurea receptors
Type:
PROTEIN
Mol. Mass.:
177013.37
Organism:
Homo sapiens (Human)
Description:
ChEMBL_1436733
Residue:
1581
  
Inhibitor
Name:
BDBM50153521
Synonyms:
2-Methoxy-4-{[(S)-3-methyl-1-(2-piperidin-1-yl-phenyl)-butylcarbamoyl]-methyl}-benzoic acid | CHEMBL360610
Type:
Small organic molecule
Emp. Form.:
C26H34N2O4
Mol. Mass.:
438.5592
SMILES:
COc1cc(CC(=O)N[C@@H](CC(C)C)c2ccccc2N2CCCCC2)ccc1C(O)=O
: