Target
NUAK family SNF1-like kinase 1
Ligand
BDBM50585204
Substrate
Meas. Tech.
ChEMBL_2161737 (CHEMBL5046598)
IC50
176±n/a nM
Citation
 Drewry, DHAnnor-Gyamfi, JKWells, CIPickett, JEDederer, VPreuss, FMathea, SAxtman, AD Identification of Pyrimidine-Based Lead Compounds for Understudied Kinases Implicated in Driving Neurodegeneration. J Med Chem 65:1313-1328 (2022)  
Target
Name:
NUAK family SNF1-like kinase 1
Synonyms:
ARK5 NUAK1 OMPHK1
Type:
PROTEIN
Mol. Mass.:
74326.51
Organism:
Homo sapiens (Human)
Description:
ChEMBL_1451343
Residue:
661
  
Inhibitor
Name:
BDBM50585204
Synonyms:
CHEMBL5085698
Type:
Small organic molecule
Emp. Form.:
C20H25N7O
Mol. Mass.:
379.4588
SMILES:
C(Cc1cnc[nH]1)Nc1ccnc(Nc2cccc(CN3CCOCC3)c2)n1
: