Target
Death-associated protein kinase 3
Ligand
BDBM50516171
Substrate
Meas. Tech.
ChEMBL_2161751 (CHEMBL5046612)
IC50
>10000±n/a nM
Citation
 Drewry, DHAnnor-Gyamfi, JKWells, CIPickett, JEDederer, VPreuss, FMathea, SAxtman, AD Identification of Pyrimidine-Based Lead Compounds for Understudied Kinases Implicated in Driving Neurodegeneration. J Med Chem 65:1313-1328 (2022)  
Target
Name:
Death-associated protein kinase 3
Synonyms:
DAP kinase 3 DAPK3 ZIP-kinase | ZIPK
Type:
PROTEIN
Mol. Mass.:
52537.07
Organism:
Homo sapiens (Human)
Description:
ChEMBL_586564
Residue:
454
  
Inhibitor
Name:
BDBM50516171
Synonyms:
CHEMBL4446892
Type:
Small organic molecule
Emp. Form.:
C17H17BrF3N7O2S
Mol. Mass.:
520.327
SMILES:
Cc1nn(CC(F)(F)F)cc1Nc1ncc(Br)c(NCc2ccc(cc2)S(N)(=O)=O)n1
: