Target
Pantetheinase
Ligand
BDBM480918
Substrate
Meas. Tech.
ChEMBL_2162813 (CHEMBL5047674)
IC50
0.350000±n/a nM
Citation
 Casimiro-Garcia, AAllais, CBrennan, AChoi, CDower, GFarley, KAFleming, MFlick, AFrisbie, RKHall, JHepworth, DJones, HKnafels, JDKortum, SLovering, FEMathias, JPMohan, SMorgan, PMParng, CParris, KPullen, NSchlerman, FStansfield, JStrohbach, JWVajdos, FFVincent, FWang, HWang, XWebster, RWright, SW Discovery of a Series of Pyrimidine Carboxamides as Inhibitors of Vanin-1. J Med Chem 65:757-784 (2022)  
Target
Name:
Pantetheinase
Synonyms:
Pantetheine hydrolase VNN1 Vanin-1 | Vascular non-inflammatory molecule 1
Type:
Enzyme Catalytic Domain
Mol. Mass.:
57002.46
Organism:
Homo sapiens (Human)
Description:
O95497
Residue:
513
  
Inhibitor
Name:
BDBM480918
Synonyms:
US10906888, Example 132
Type:
Small organic molecule
Emp. Form.:
C20H24N6O3
Mol. Mass.:
396.443
SMILES:
O=C(N1CCC2(C1)CCOCC2)c1cnc(NC2(COC2)c2cnccn2)nc1
: