Target
Pantetheinase
Ligand
BDBM480929
Substrate
Meas. Tech.
ChEMBL_2162813 (CHEMBL5047674)
IC50
0.080000±n/a nM
Citation
 Casimiro-Garcia, AAllais, CBrennan, AChoi, CDower, GFarley, KAFleming, MFlick, AFrisbie, RKHall, JHepworth, DJones, HKnafels, JDKortum, SLovering, FEMathias, JPMohan, SMorgan, PMParng, CParris, KPullen, NSchlerman, FStansfield, JStrohbach, JWVajdos, FFVincent, FWang, HWang, XWebster, RWright, SW Discovery of a Series of Pyrimidine Carboxamides as Inhibitors of Vanin-1. J Med Chem 65:757-784 (2022)  
Target
Name:
Pantetheinase
Synonyms:
Pantetheine hydrolase VNN1 Vanin-1 | Vascular non-inflammatory molecule 1
Type:
Enzyme Catalytic Domain
Mol. Mass.:
57002.46
Organism:
Homo sapiens (Human)
Description:
O95497
Residue:
513
  
Inhibitor
Name:
BDBM480929
Synonyms:
8-oxa-2-azaspiro[4.5]dec-2-yl(2-{[2-(pyrimidin-5-yl)propan-2-yl]amino}pyrimidin-5-yl)methanone | US10906888, Example 143
Type:
Small organic molecule
Emp. Form.:
C20H26N6O2
Mol. Mass.:
382.4594
SMILES:
CC(C)(Nc1ncc(cn1)C(=O)N1CCC2(C1)CCOCC2)c1cncnc1
: