Target
Toll-like receptor 7
Ligand
BDBM50586256
Substrate
Meas. Tech.
ChEMBL_2165745 (CHEMBL5050606)
IC50
0.670000±n/a nM
Citation
 Betschart, CFaller, MZink, FHemmig, RBlank, JVangrevelinghe, EBourrel, MGlatthar, RBehnke, DBarker, KHeizmann, AAngst, DNimsgern, PJacquier, SJunt, TZipfel, GRuzzante, GLoetscher, PLimonta, SHawtin, SAndre, CBBoulay, TFeifel, RKnoepfel, T Structure-Based Optimization of a Fragment-like TLR8 Binding Screening Hit to an  ACS Med Chem Lett 13:658-664 (2022)  
Target
Name:
Toll-like receptor 7
Synonyms:
ORF Names:UNQ248/PRO285 TLR7_HUMAN | Toll-like receptor 7 (TLR7)
Type:
Enzyme
Mol. Mass.:
120945.35
Organism:
Homo sapiens (Human)
Description:
Q9NYK1
Residue:
1049
  
Inhibitor
Name:
BDBM50586256
Synonyms:
CHEMBL5085458
Type:
Small organic molecule
Emp. Form.:
C20H24FN5O
Mol. Mass.:
369.4359
SMILES:
COc1cc2c(NC3CCN(C)CC3)n[nH]c2cc1-c1ccnc(C)c1F
: