Target
Dimer of Protein farnesyltransferase subunit beta
Ligand
BDBM50155775
Substrate
Meas. Tech.
ChEMBL_304862 (CHEMBL828420)
IC50
0.4±n/a nM
Citation
 Njoroge, FGVibulbhan, BShi, XStrickland, CKirschmeier, PBishop, RNomeir, AGirijavallabhan, V Bridgehead modification of trihalocycloheptabenzopyridine leads to a potent farnesyl protein transferase inhibitor with improved oral metabolic stability. Bioorg Med Chem Lett 14:5899-902 (2004)  
Target
Name:
Dimer of Protein farnesyltransferase subunit beta
Synonyms:
Protein Farnesyltransferase (PFT) Chain B
Type:
Mol. Mass.:
Description:
ASSAY_ID of EBI is 51428
Components:
This complex has 3 components.
Component 1
Name:
Protein farnesyltransferase subunit beta
Synonyms:
CAAX farnesyltransferase subunit alpha FNTB FTase-alpha GGTase-I-alpha Protein farnesyl/geranylgeranyl transferase Protein farnesyltransferase subunit beta Protein farnesyltransferase/geranylgeranyltransferase type-1 subunit alpha Ras proteins prenyltransferase subunit beta | Type I protein geranyl-geranyltransferase subunit alpha
Type:
Enzyme Subunit
Mol. Mass.:
48766.02
Organism:
Homo sapiens (Human)
Description:
Protein farnesyltransferase subunit beta
Residue:
437
  
Component 2
Name:
Protein farnesyltransferase subunit beta
Synonyms:
CAAX farnesyltransferase subunit alpha FNTB FTase-alpha GGTase-I-alpha Protein farnesyl/geranylgeranyl transferase Protein farnesyltransferase subunit beta Protein farnesyltransferase/geranylgeranyltransferase type-1 subunit alpha Ras proteins prenyltransferase subunit beta | Type I protein geranyl-geranyltransferase subunit alpha
Type:
Enzyme Subunit
Mol. Mass.:
48766.02
Organism:
Homo sapiens (Human)
Description:
Protein farnesyltransferase subunit beta
Residue:
437
  
Inhibitor
Name:
BDBM50155775
Synonyms:
4-{2-[4-((S)-3,10-Dibromo-8-chloro-11H-benzo[5,6]cyclohepta[1,2-b]pyridin-11-yl)-piperidin-1-yl]-2-oxo-ethyl}-piperidine-1-carboxylic acid amide | CHEMBL364342
Type:
Small organic molecule
Emp. Form.:
C27H29Br2ClN4O2
Mol. Mass.:
636.806
SMILES:
NC(=O)N1CCC(CC(=O)N2CCC(CC2)[C@@H]2c3ncc(Br)cc3C=Cc3cc(Cl)cc(Br)c23)CC1
: