Target
Tyrosine-protein kinase BTK
Ligand
BDBM465744
Substrate
Meas. Tech.
ChEMBL_2169136 (CHEMBL5054195)
IC50
0.140000±n/a nM
Citation
 Kawahata, WAsami, TKiyoi, TIrie, TKashimoto, SFuruichi, HSawa, M Discovery of AS-1763: A Potent, Selective, Noncovalent, and Orally Available Inhibitor of Bruton's Tyrosine Kinase. J Med Chem 64:14129-14141 (2021)  
Target
Name:
Tyrosine-protein kinase BTK
Synonyms:
AGMX1 Agammaglobulinaemia tyrosine kinase B cell progenitor kinase BPK BTK_HUMAN Tyrosine Kinase BTK Tyrosine-protein kinase BTK (BTK)
Type:
Enzyme
Mol. Mass.:
76289.95
Organism:
Homo sapiens (Human)
Description:
Q06187
Residue:
659
  
Inhibitor
Name:
BDBM465744
Synonyms:
2-{3-[2-amino-6-(pyridin-4-yl)-7H- pyrrolo[2,3-d]pyrimidin-4-yl]-2- (hydroxymethyl)phenyl}-6-cyclopropyl- 8-fluoroisoquinolin-1(2H)-one | US10793575, Example 19
Type:
Small organic molecule
Emp. Form.:
C30H23FN6O2
Mol. Mass.:
518.541
SMILES:
Nc1nc(-c2cccc(c2CO)-n2ccc3cc(cc(F)c3c2=O)C2CC2)c2cc([nH]c2n1)-c1ccncc1
: