Target
Peroxisomal acyl-coenzyme A oxidase 1
Ligand
BDBM50156436
Substrate
Meas. Tech.
ChEMBL_311972 (CHEMBL834389)
IC50
1300±n/a nM
Citation
 Elzein, EIbrahim, PKoltun, DORehder, KShenk, KDMarquart, TAJiang, BLi, XNatero, RLi, YNguyen, MKerwar, SChu, NSoohoo, DHao, JMaydanik, VYLustig, DAZeng, DLeung, KZablocki, JA CVT-4325: a potent fatty acid oxidation inhibitor with favorable oral bioavailability. Bioorg Med Chem Lett 14:6017-21 (2004)  
Target
Name:
Peroxisomal acyl-coenzyme A oxidase 1
Synonyms:
ACOX1_RAT Acox Palmitoyl-CoA oxidase Peroxisomal acyl-CoA oxidase 1, B chain Peroxisomal acyl-coenzyme A oxidase 1
Type:
PROTEIN
Mol. Mass.:
74693.04
Organism:
Rattus norvegicus
Description:
ChEMBL_311972
Residue:
661
  
Inhibitor
Name:
BDBM50156436
Synonyms:
(R)-1-(2-Methyl-benzothiazol-5-yloxy)-3-{4-[2-(4-trifluoromethyl-phenyl)-thiazol-4-ylmethyl]-piperazin-1-yl}-propan-2-ol | CHEMBL184758
Type:
Small organic molecule
Emp. Form.:
C26H27F3N4O2S2
Mol. Mass.:
548.643
SMILES:
Cc1nc2cc(OC[C@H](O)CN3CCN(Cc4csc(n4)-c4ccc(cc4)C(F)(F)F)CC3)ccc2s1
: