Target
Peroxisomal acyl-coenzyme A oxidase 1
Ligand
BDBM50138599
Substrate
Meas. Tech.
ChEMBL_312558 (CHEMBL834349)
IC50
2500±n/a nM
Citation
 Elzein, EIbrahim, PKoltun, DORehder, KShenk, KDMarquart, TAJiang, BLi, XNatero, RLi, YNguyen, MKerwar, SChu, NSoohoo, DHao, JMaydanik, VYLustig, DAZeng, DLeung, KZablocki, JA CVT-4325: a potent fatty acid oxidation inhibitor with favorable oral bioavailability. Bioorg Med Chem Lett 14:6017-21 (2004)  
Target
Name:
Peroxisomal acyl-coenzyme A oxidase 1
Synonyms:
ACOX1_RAT Acox Palmitoyl-CoA oxidase Peroxisomal acyl-CoA oxidase 1, B chain Peroxisomal acyl-coenzyme A oxidase 1
Type:
PROTEIN
Mol. Mass.:
74693.04
Organism:
Rattus norvegicus
Description:
ChEMBL_311972
Residue:
661
  
Inhibitor
Name:
BDBM50138599
Synonyms:
CHEMBL154751 | N-(2,6-Dimethyl-phenyl)-2-{4-[(R)-2-hydroxy-3-(2-methyl-benzothiazol-5-yloxy)-propyl]-piperazin-1-yl}-acetamide
Type:
Small organic molecule
Emp. Form.:
C25H32N4O3S
Mol. Mass.:
468.612
SMILES:
Cc1nc2cc(OC[C@H](O)CN3CCN(CC(=O)Nc4c(C)cccc4C)CC3)ccc2s1
: