Target
Amyloid-beta precursor protein
Ligand
BDBM50587299
Substrate
Meas. Tech.
ChEMBL_2172134 (CHEMBL5057268)
Kd
1547000±n/a nM
Citation
 Falkenstein, MReiner-Link, DZivkovic, AGering, IWillbold, DStark, H Histamine H Bioorg Med Chem 50:0 (2021)  
Target
Name:
Amyloid-beta precursor protein
Synonyms:
A4 ABPP AICD-50 AICD-59 AID(57) APP Alzheimer disease amyloid protein Amyloid beta Protein Amyloid beta protein Abeta(1-42) Amyloid intracellular domain 57 Amyloid protein (Abeta42b) Beta amyloid A4 protein Beta-APP42 Beta-amyloid protein 42 C83 CVAP Gamma Secretase Gamma-CTF(57) Gamma-secretase Gamma-secretase C-terminal fragment 57 P3(40) PN-II Protease nexin-II S-APP-beta Soluble APP-beta | beta-Amyloid Precursor Protein (APP)
Type:
Single-pass type I membrane protein
Mol. Mass.:
86890.41
Organism:
Homo sapiens (Human)
Description:
P05067
Residue:
770
  
Inhibitor
Name:
BDBM50587299
Synonyms:
CHEMBL5077020
Type:
Small organic molecule
Emp. Form.:
C19H27N3O3
Mol. Mass.:
345.436
SMILES:
O=C1CN(Cc2ccc(OCCCN3CCCCC3)cc2)C(=O)CN1
: