Target
5-hydroxytryptamine receptor 7
Ligand
BDBM21367
Substrate
Meas. Tech.
ChEMBL_430134 (CHEMBL919612)
Ki
0.22±n/a nM
Citation
 Leopoldo, MBerardi, FColabufo, NAContino, MLacivita, ENiso, MPerrone, RTortorella, V Structure-affinity relationship study on N-(1,2,3,4-tetrahydronaphthalen-1-yl)-4-aryl-1-piperazinealkylamides, a new class of 5-hydroxytryptamine7 receptor agents. J Med Chem 47:6616-24 (2004)  
Target
Name:
5-hydroxytryptamine receptor 7
Synonyms:
5-HT-7 5-HT7 5-HT7S 5-hydroxytryptamine receptor 7 5HT7R_RAT GPRFO Serotonin (5-HT) receptor | Serotonin Receptor 7
Type:
G Protein-Coupled Receptor (GPCR)
Mol. Mass.:
49852.62
Organism:
Rattus norvegicus (rat)
Description:
Rat cloned 5-HT7R.
Residue:
448
  
Inhibitor
Name:
BDBM21367
Synonyms:
6-{4-[2-(methylsulfanyl)phenyl]piperazin-1-yl}-N-(1,2,3,4-tetrahydronaphthalen-1-yl)hexanamide LP-44 | Piperazinehexanamide derivative, 5
Type:
Small organic molecule
Emp. Form.:
C27H37N3OS
Mol. Mass.:
451.667
SMILES:
CSc1ccccc1N1CCN(CCCCCC(=O)NC2CCCc3ccccc23)CC1
: