Target
DNA excision repair protein ERCC-5
Ligand
BDBM50157847
Substrate
Meas. Tech.
ChEMBL_305129 (CHEMBL832425)
IC50
0.55±n/a nM
Citation
 Tumey, LNBom, DHuck, BGleason, EWang, JSilver, DBrunden, KBoozer, SRundlett, SSherf, BMurphy, SDent, TLeventhal, CBailey, AHarrington, JBennani, YL The identification and optimization of a N-hydroxy urea series of flap endonuclease 1 inhibitors. Bioorg Med Chem Lett 15:277-81 (2004)  
Target
Name:
DNA excision repair protein ERCC-5
Synonyms:
ERCC5 ERCM2 XPGC
Type:
PROTEIN
Mol. Mass.:
133069.11
Organism:
Homo sapiens (Human)
Description:
ChEMBL_305129
Residue:
1186
  
Inhibitor
Name:
BDBM50157847
Synonyms:
1-(3-Bromo-benzyl)-3-hydroxy-1H-thieno[3,2-d]pyrimidine-2,4-dione | CHEMBL185322
Type:
Small organic molecule
Emp. Form.:
C13H9BrN2O3S
Mol. Mass.:
353.191
SMILES:
On1c(=O)n(Cc2cccc(Br)c2)c2ccsc2c1=O
: