Target
Induced myeloid leukemia cell differentiation protein Mcl-1
Ligand
BDBM470606
Substrate
Meas. Tech.
ChEMBL_2184259 (CHEMBL5096341)
Ki
0.012000±n/a nM
Citation
 Li, K Interdiction at a protein-protein interface: MCL-1 inhibitors for oncology. Bioorg Med Chem Lett 32:0 (2021) Target
Name:
Induced myeloid leukemia cell differentiation protein Mcl-1
Synonyms:
BCL2L3 Bcl-2-like protein 3 (Mcl-1) Bcl2-L-3 MCL1 Mcl-1 Myeloid cell leukemia sequence 1 (BCL2-related) | mcl1/EAT
Type:
Membrane; Single-pass membrane protein
Mol. Mass.:
37332.87
Organism:
Homo sapiens (Human)
Description:
Q07820
Residue:
350
  
Inhibitor
Name:
BDBM470606
Synonyms:
US10821115, Example 10 | US11224601, Example 10
Type:
Small organic molecule
Emp. Form.:
C42H57ClN4O5S
Mol. Mass.:
765.444
SMILES:
CO[C@]1(CN2CCN3CCCC[C@@H]3C2)\C=C\C[C@H](C)[C@@H](C)S(=O)(=O)NC(=O)c2ccc3OC[C@]4(CCCc5cc(Cl)ccc45)CN(C[C@@H]4CC[C@@H]14)c3c2
: