Target
Induced myeloid leukemia cell differentiation protein Mcl-1
Ligand
BDBM471064
Substrate
Meas. Tech.
ChEMBL_2184259 (CHEMBL5096341)
Ki
0.014000±n/a nM
Citation
 Li, K Interdiction at a protein-protein interface: MCL-1 inhibitors for oncology. Bioorg Med Chem Lett 32:0 (2021) Target
Name:
Induced myeloid leukemia cell differentiation protein Mcl-1
Synonyms:
BCL2L3 Bcl-2-like protein 3 (Mcl-1) Bcl2-L-3 MCL1 Mcl-1 Myeloid cell leukemia sequence 1 (BCL2-related) | mcl1/EAT
Type:
Membrane; Single-pass membrane protein
Mol. Mass.:
37332.87
Organism:
Homo sapiens (Human)
Description:
Q07820
Residue:
350
  
Inhibitor
Name:
BDBM471064
Synonyms:
US10821115, Example 100077 US11224601, Example 100078
Type:
Small organic molecule
Emp. Form.:
C36H46ClN3O6S
Mol. Mass.:
684.285
SMILES:
C[C@H]1C\C=C\[C@@](O)(CC(=O)N(C)C)[C@@H]2CC[C@H]2CN2C[C@@]3(CCCc4cc(Cl)ccc34)COc3ccc(cc23)C(=O)NS(=O)(=O)[C@@H]1C
: