Target
Induced myeloid leukemia cell differentiation protein Mcl-1
Ligand
BDBM50514196
Substrate
Meas. Tech.
ChEMBL_2184259 (CHEMBL5096341)
Ki
0.050000±n/a nM
Citation
 Li, K Interdiction at a protein-protein interface: MCL-1 inhibitors for oncology. Bioorg Med Chem Lett 32:0 (2021) Target
Name:
Induced myeloid leukemia cell differentiation protein Mcl-1
Synonyms:
BCL2L3 Bcl-2-like protein 3 (Mcl-1) Bcl2-L-3 MCL1 Mcl-1 Myeloid cell leukemia sequence 1 (BCL2-related) | mcl1/EAT
Type:
Membrane; Single-pass membrane protein
Mol. Mass.:
37332.87
Organism:
Homo sapiens (Human)
Description:
Q07820
Residue:
350
  
Inhibitor
Name:
BDBM50514196
Synonyms:
CHEMBL4476472
Type:
Small organic molecule
Emp. Form.:
C32H39ClN2O5S
Mol. Mass.:
599.18
SMILES:
[H][C@@]12CC[C@@]1([H])[C@@H](O)\C=C\C[C@H](C)[C@@H](C)S(=O)(=O)NC(=O)c1ccc3OC[C@]4(CCCc5cc(Cl)ccc45)CN(C2)c3c1
: